Reaction Details
TargetSerine/threonine-protein kinase PAK 4
LigandBDBM50097149
Substrate/Competitorn/a
Meas. Tech.ChEMBL_1499558 (CHEMBL3584416)
Ki 283±n/a nM
Citation Crawford, JJLee, WAliagas, IMathieu, SHoeflich, KPZhou, WWang, WRouge, LMurray, LLa, HLiu, NFan, PWCheong, JHeise, CERamaswamy, SMintzer, RLiu, YChao, QRudolph, J Structure-Guided Design of Group I Selective p21-Activated Kinase Inhibitors. J Med Chem58:5121-36 (2015) 
 
Serine/threonine-protein kinase PAK 4
Name:Serine/threonine-protein kinase PAK 4
Type:Protein
Mol. Mass.:64098.01
Organism:Homo sapiens (Human)
Description:O96013
Residue:591
BDBM50097149
NameBDBM50097149
Synonyms:CHEMBL3580957
TypeSmall organic molecule
Emp. Form.C15H21N7
Mol. Mass.299.3741
SMILESNC1CCN(CC1)c1nccc(Nc2cc([nH]n2)C2CC2)n1