Reaction Details
TargetSerine/threonine-protein kinase PAK 4
LigandBDBM50097119
Substrate/Competitorn/a
Meas. Tech.ChEMBL_1499558 (CHEMBL3584416)
Ki 45±n/a nM
Citation Crawford, JJLee, WAliagas, IMathieu, SHoeflich, KPZhou, WWang, WRouge, LMurray, LLa, HLiu, NFan, PWCheong, JHeise, CERamaswamy, SMintzer, RLiu, YChao, QRudolph, J Structure-Guided Design of Group I Selective p21-Activated Kinase Inhibitors. J Med Chem58:5121-36 (2015) 
 
Serine/threonine-protein kinase PAK 4
Name:Serine/threonine-protein kinase PAK 4
Type:Protein
Mol. Mass.:64098.01
Organism:Homo sapiens (Human)
Description:O96013
Residue:591
BDBM50097119
NameBDBM50097119
Synonyms:CHEMBL3580956
TypeSmall organic molecule
Emp. Form.C17H21N7O
Mol. Mass.339.3949
SMILESNC1CCN(CC1)c1nc(Nc2cc([nH]n2)C2CC2)c2occc2n1