Reaction Details
TargetSarcoplasmic/endoplasmic reticulum calcium ATPase 1
LigandBDBM50097548
Substrate/Competitorn/a
Meas. Tech.ChEMBL_1500494 (CHEMBL3587394)
Kd 96500±n/a nM
Citation De Ford, CCalderón, CSehgal, PFedosova, NUMurillo, ROlesen, CNissen, PMĝller, JVMerfort, I Discovery of Tricyclic Clerodane Diterpenes as Sarco/Endoplasmic Reticulum Ca(2+)-ATPase Inhibitors and Structure-Activity Relationships. J Nat Prod78:1262-70 (2015) 
 
Sarcoplasmic/endoplasmic reticulum calcium ATPase 1
Name:Sarcoplasmic/endoplasmic reticulum calcium ATPase 1
Type:PROTEIN
Mol. Mass.:110435.34
Organism:Oryctolagus cuniculus
Description:ChEMBL_1500621
Residue:1001
BDBM50097548
NameBDBM50097548
Synonyms:CHEMBL3586098
TypeSmall organic molecule
Emp. Form.C24H32O6
Mol. Mass.416.5073
SMILES[H][C@@]12CC(=O)C=C3[C@@H](OC(C)=O)O[C@@H](OC(C)=O)[C@@]13CC[C@@H](C)[C@@]2(C)C\C=C(/C)C=C