Reaction Details
TargetN-formyl peptide receptor 2
LigandBDBM50098000
Substrate/Competitorn/a
Meas. Tech.ChEMBL_1502493 (CHEMBL3592315)
EC50 140±n/a nM
Citation Stepniewski, TMFilipek, S Non-peptide ligand binding to the formyl peptide receptor FPR2--A comparison to peptide ligand binding modes. Bioorg Med Chem23:4072-81 (2015) 
 
N-formyl peptide receptor 2
Name:N-formyl peptide receptor 2
Type:G Protein-Coupled Receptor (GPCR)
Mol. Mass.:38968.35
Organism:Homo sapiens (Human)
Description:P25090
Residue:351
BDBM50098000
NameBDBM50098000
Synonyms:CHEMBL3588922
TypeSmall organic molecule
Emp. Form.C43H55N5O5
Mol. Mass.721.9273
SMILESCCC[C@H]1CNC(=O)C(=O)N1C[C@@H]1CCCN1C[C@@H](Cc1ccc2ccccc2c1)N1C[C@@H](Cc2ccc(O)cc2)N(CC2CCCCC2)C(=O)C1=O