Reaction Details
TargetN-formyl peptide receptor 2
LigandBDBM50098001
Substrate/Competitorn/a
Meas. Tech.ChEMBL_1502492 (CHEMBL3592314)
IC50 90±n/a nM
Citation Stepniewski, TMFilipek, S Non-peptide ligand binding to the formyl peptide receptor FPR2--A comparison to peptide ligand binding modes. Bioorg Med Chem23:4072-81 (2015) 
 
N-formyl peptide receptor 2
Name:N-formyl peptide receptor 2
Type:G Protein-Coupled Receptor (GPCR)
Mol. Mass.:38968.35
Organism:Homo sapiens (Human)
Description:P25090
Residue:351
BDBM50098001
NameBDBM50098001
Synonyms:CHEMBL3590217
TypeSmall organic molecule
Emp. Form.C26H29N3O3
Mol. Mass.431.5268
SMILESCCCCOc1ccc(cc1)C(=O)NN1Cc2ccccc2NC1c1ccc(OC)cc1