Reaction Details
TargetN-formyl peptide receptor 2
LigandBDBM50098056
Substrate/Competitorn/a
Meas. Tech.ChEMBL_1502490 (CHEMBL3592312)
EC50 7300±n/a nM
Citation Stepniewski, TMFilipek, S Non-peptide ligand binding to the formyl peptide receptor FPR2--A comparison to peptide ligand binding modes. Bioorg Med Chem23:4072-81 (2015) 
 
N-formyl peptide receptor 2
Name:N-formyl peptide receptor 2
Type:G Protein-Coupled Receptor (GPCR)
Mol. Mass.:38968.35
Organism:Homo sapiens (Human)
Description:P25090
Residue:351
BDBM50098056
NameBDBM50098056
Synonyms:CHEMBL3590212
TypeSmall organic molecule
Emp. Form.C18H18N4O4S
Mol. Mass.386.425
SMILESCOC(=O)Nc1cccc(NC(=O)CSc2nc3cc(OC)ccc3[nH]2)c1