Reaction Details
TargetN-formyl peptide receptor 2
LigandBDBM50098173
Substrate/Competitorn/a
Meas. Tech.ChEMBL_1502490 (CHEMBL3592312)
EC50 7.0±n/a nM
Citation Stepniewski, TMFilipek, S Non-peptide ligand binding to the formyl peptide receptor FPR2--A comparison to peptide ligand binding modes. Bioorg Med Chem23:4072-81 (2015) 
 
N-formyl peptide receptor 2
Name:N-formyl peptide receptor 2
Type:G Protein-Coupled Receptor (GPCR)
Mol. Mass.:38968.35
Organism:Homo sapiens (Human)
Description:P25090
Residue:351
BDBM50098173
NameBDBM50098173
Synonyms:CHEMBL3590206
TypeSmall organic molecule
Emp. Form.C24H28BrN3O4
Mol. Mass.502.401
SMILESCCOC(=O)C1CCCN(C1)C(=O)[C@H](Cc1ccccc1)NC(=O)Nc1ccc(Br)cc1