Reaction Details
TargetHistone deacetylase 1
LigandBDBM50322422
Substrate/Competitorn/a
Meas. Tech.ChEMBL_1505084 (CHEMBL3596003)
IC50 10±n/a nM
Citation Clausen, DJSmith, WBHaines, BEWiest, OBradner, JEWilliams, RM Modular synthesis and biological activity of pyridyl-based analogs of the potent Class I Histone Deacetylase Inhibitor Largazole. Bioorg Med Chem23:5061-74 (2015) 
 
Histone deacetylase 1
Name:Histone deacetylase 1
Type:Enzyme
Mol. Mass.:55090.27
Organism:Homo sapiens (Human)
Description:Q13547
Residue:482
BDBM50322422
NameBDBM50322422
Synonyms:CHEMBL1173445 | Largazole
TypeSmall organic molecule
Emp. Form.C29H42N4O5S3
Mol. Mass.622.863
SMILESCCCCCCCC(=O)SCC\C=C\[C@@H]1CC(=O)NCc2nc(cs2)C2=N[C@@](C)(CS2)C(=O)N[C@@H](C(C)C)C(=O)O1