Reaction Details
TargetHistone deacetylase 1
LigandBDBM50098418
Substrate/Competitorn/a
Meas. Tech.ChEMBL_1505084 (CHEMBL3596003)
IC50 2.7±n/a nM
Citation Clausen, DJSmith, WBHaines, BEWiest, OBradner, JEWilliams, RM Modular synthesis and biological activity of pyridyl-based analogs of the potent Class I Histone Deacetylase Inhibitor Largazole. Bioorg Med Chem23:5061-74 (2015) 
 
Histone deacetylase 1
Name:Histone deacetylase 1
Type:Enzyme
Mol. Mass.:55090.27
Organism:Homo sapiens (Human)
Description:Q13547
Residue:482
BDBM50098418
NameBDBM50098418
Synonyms:CHEMBL3593409
TypeSmall organic molecule
Emp. Form.C23H30N4O4S2
Mol. Mass.490.639
SMILESCC(C)[C@@H]1NC(=O)[C@]2(C)CSC(=N2)c2cccc(CNC(=O)C[C@H](OC1=O)\C=C\CCS)n2