Reaction Details
TargetHistone deacetylase 2
LigandBDBM50098414
Substrate/Competitorn/a
Meas. Tech.ChEMBL_1505085 (CHEMBL3596004)
IC50 4.2±n/a nM
Citation Clausen, DJSmith, WBHaines, BEWiest, OBradner, JEWilliams, RM Modular synthesis and biological activity of pyridyl-based analogs of the potent Class I Histone Deacetylase Inhibitor Largazole. Bioorg Med Chem23:5061-74 (2015) 
 
Histone deacetylase 2
Name:Histone deacetylase 2
Type:Chromatin regulator; hydrolase; repressor
Mol. Mass.:55356.54
Organism:Homo sapiens (Human)
Description:Q92769
Residue:488
BDBM50098414
NameBDBM50098414
Synonyms:CHEMBL3593247
TypeSmall organic molecule
Emp. Form.C21H28N4O4S3
Mol. Mass.496.666
SMILESCC(C)[C@@H]1NC(=O)[C@]2(C)CSC(=N2)c2csc(CNC(=O)C[C@H](OC1=O)\C=C\CCS)n2