Reaction Details
TargetHistone deacetylase 3
LigandBDBM50098414
Substrate/Competitorn/a
Meas. Tech.ChEMBL_1505086 (CHEMBL3596005)
IC50 2.8±n/a nM
Citation Clausen, DJSmith, WBHaines, BEWiest, OBradner, JEWilliams, RM Modular synthesis and biological activity of pyridyl-based analogs of the potent Class I Histone Deacetylase Inhibitor Largazole. Bioorg Med Chem23:5061-74 (2015) 
 
Histone deacetylase 3
Name:Histone deacetylase 3
Type:Enzyme
Mol. Mass.:48829.55
Organism:Homo sapiens (Human)
Description:O15379
Residue:428
BDBM50098414
NameBDBM50098414
Synonyms:CHEMBL3593247
TypeSmall organic molecule
Emp. Form.C21H28N4O4S3
Mol. Mass.496.666
SMILESCC(C)[C@@H]1NC(=O)[C@]2(C)CSC(=N2)c2csc(CNC(=O)C[C@H](OC1=O)\C=C\CCS)n2