Reaction Details
TargetHistone deacetylase 3
LigandBDBM50098418
Substrate/Competitorn/a
Meas. Tech.ChEMBL_1505086 (CHEMBL3596005)
IC50 3.1±n/a nM
Citation Clausen, DJSmith, WBHaines, BEWiest, OBradner, JEWilliams, RM Modular synthesis and biological activity of pyridyl-based analogs of the potent Class I Histone Deacetylase Inhibitor Largazole. Bioorg Med Chem23:5061-74 (2015) 
 
Histone deacetylase 3
Name:Histone deacetylase 3
Type:Enzyme
Mol. Mass.:48829.55
Organism:Homo sapiens (Human)
Description:O15379
Residue:428
BDBM50098418
NameBDBM50098418
Synonyms:CHEMBL3593409
TypeSmall organic molecule
Emp. Form.C23H30N4O4S2
Mol. Mass.490.639
SMILESCC(C)[C@@H]1NC(=O)[C@]2(C)CSC(=N2)c2cccc(CNC(=O)C[C@H](OC1=O)\C=C\CCS)n2