Reaction Details
TargetSimilar to alpha-tubulin isoform 1/Tubulin beta-2B chain
LigandBDBM50098800
Substrate/Competitorn/a
Meas. Tech.ChEMBL_1504929 (CHEMBL3595578)
IC50 4900±n/a nM
Citation Lee, HYChang, CYLai, MJChuang, HYKuo, CCChang, CYChang, JYLiou, JP Antimitotic and antivascular activity of heteroaroyl-2-hydroxy-3,4,5-trimethoxybenzenes. Bioorg Med Chem23:4230-6 (2015) 
 
Similar to alpha-tubulin isoform 1/Tubulin beta-2B chain
Name:Similar to alpha-tubulin isoform 1/Tubulin beta-2B chain
Type:n/a
Mol. Mass.:n/a
Description:ASSAY_ID of EBI is 51441
Components:This complex has 2 components.
Component 1
Name:Tubulin beta-2B chain
Synonyms:TBB2B_BOVIN Tubulin | Tubulin beta chain
Type:PROTEIN
Mol. Mass.:49932.38
Organism:Bos taurus
Description:ChEMBL_211651
Residue:445
Component 2
Name:Similar to alpha-tubulin isoform 1
Synonyms:Tubulin
Type:PROTEIN
Mol. Mass.:9422.48
Organism:Bos taurus
Description:EBI_18002
Residue:84
BDBM50098800
NameBDBM50098800
Synonyms:CHEMBL3593872
TypeSmall organic molecule
Emp. Form.C19H19NO5
Mol. Mass.341.3579
SMILESCOc1cc(C(=O)c2ccc3n(C)ccc3c2)c(O)c(OC)c1OC