Reaction Details
TargetProteasome subunit beta type-8
LigandBDBM50099685
Substrate/Competitorn/a
Meas. Tech.ChEMBL_1446797 (CHEMBL3371271)
IC50 3.0±n/a nM
Citation de Bruin, GHuber, EMXin, BTvan Rooden, EJAl-Ayed, KKim, KBKisselev, AFDriessen, Cvan der Stelt, Mvan der Marel, GAGroll, MOverkleeft, HS Structure-based design of฿1i or฿5i specific inhibitors of human immunoproteasomes. J Med Chem57:6197-209 (2014) 
 
Proteasome subunit beta type-8
Name:Proteasome subunit beta type-8
Type:PROTEIN
Mol. Mass.:30357.49
Organism:Homo sapiens (Human)
Description:ChEMBL_1446797
Residue:276
BDBM50099685
NameBDBM50099685
Synonyms:CHEMBL3319578
TypeSmall organic molecule
Emp. Form.C36H45N3O6
Mol. Mass.615.759
SMILESCOc1ccc(C[C@H](NC(=O)[C@H](C)NC(=O)C2=C(C)c3ccccc3C2)C(=O)N[C@@H](CC2CCCCC2)C(=O)[C@@]2(C)CO2)cc1