Reaction Details
TargetProteasome subunit beta type-8
LigandBDBM50099831
Substrate/Competitorn/a
Meas. Tech.ChEMBL_1446797 (CHEMBL3371271)
IC50 2.1±n/a nM
Citation de Bruin, GHuber, EMXin, BTvan Rooden, EJAl-Ayed, KKim, KBKisselev, AFDriessen, Cvan der Stelt, Mvan der Marel, GAGroll, MOverkleeft, HS Structure-based design of฿1i or฿5i specific inhibitors of human immunoproteasomes. J Med Chem57:6197-209 (2014) 
 
Proteasome subunit beta type-8
Name:Proteasome subunit beta type-8
Type:PROTEIN
Mol. Mass.:30357.49
Organism:Homo sapiens (Human)
Description:ChEMBL_1446797
Residue:276
BDBM50099831
NameBDBM50099831
Synonyms:CHEMBL3319586
TypeSmall organic molecule
Emp. Form.C38H43N5O6
Mol. Mass.665.7779
SMILESC[C@@H](NC(=O)CN1CCOCC1)C(=O)N[C@@H](Cc1c[nH]c2ccccc12)C(=O)N[C@@H](Cc1ccc(cc1)-c1ccccc1)C(=O)[C@@]1(C)CO1