Reaction Details
TargetProteasome subunit beta type-8
LigandBDBM50099832
Substrate/Competitorn/a
Meas. Tech.ChEMBL_1446797 (CHEMBL3371271)
IC50 1.2±n/a nM
Citation de Bruin, GHuber, EMXin, BTvan Rooden, EJAl-Ayed, KKim, KBKisselev, AFDriessen, Cvan der Stelt, Mvan der Marel, GAGroll, MOverkleeft, HS Structure-based design of฿1i or฿5i specific inhibitors of human immunoproteasomes. J Med Chem57:6197-209 (2014) 
 
Proteasome subunit beta type-8
Name:Proteasome subunit beta type-8
Type:PROTEIN
Mol. Mass.:30357.49
Organism:Homo sapiens (Human)
Description:ChEMBL_1446797
Residue:276
BDBM50099832
NameBDBM50099832
Synonyms:CHEMBL3319587
TypeSmall organic molecule
Emp. Form.C37H44N4O7
Mol. Mass.656.7679
SMILESCOc1ccc(C[C@H](NC(=O)[C@@H](C)NC(=O)CN2CCOCC2)C(=O)N[C@@H](Cc2ccc(cc2)-c2ccccc2)C(=O)[C@@]2(C)CO2)cc1