Reaction Details
TargetProteasome subunit beta type-9
LigandBDBM50099950
Substrate/Competitorn/a
Meas. Tech.ChEMBL_1446800 (CHEMBL3371274)
IC50 66±n/a nM
Citation de Bruin, GHuber, EMXin, BTvan Rooden, EJAl-Ayed, KKim, KBKisselev, AFDriessen, Cvan der Stelt, Mvan der Marel, GAGroll, MOverkleeft, HS Structure-based design of฿1i or฿5i specific inhibitors of human immunoproteasomes. J Med Chem57:6197-209 (2014) 
 
Proteasome subunit beta type-9
Name:Proteasome subunit beta type-9
Type:PROTEIN
Mol. Mass.:23256.49
Organism:Homo sapiens (Human)
Description:ChEMBL_106197
Residue:219
BDBM50099950
NameBDBM50099950
Synonyms:CHEMBL3319601
TypeSmall organic molecule
Emp. Form.C28H39N7O6
Mol. Mass.569.6526
SMILESCCCC[C@H](NC(=O)[C@@H]1CCCN1C(=O)[C@H](C)NC(=O)CN=[N+]=[N-])C(=O)N[C@@H](Cc1ccccc1)C(=O)[C@@]1(C)CO1