Reaction Details
TargetPlatelet-derived growth factor receptor beta
LigandBDBM50192852
Substrate/Competitorn/a
Meas. Tech.ChEBML_1447789
IC50 12000±n/a nM
Citation Horbert, RPinchuk, BJohannes, ESchlosser, JSchmidt, DCappel, DTotzke, FSchächtele, CPeifer, C Optimization of potent DFG-in inhibitors of platelet derived growth factor receptorß (PDGF-Rß) guided by water thermodynamics. J Med Chem58:170-82 (2015) 
 
Platelet-derived growth factor receptor beta
Name:Platelet-derived growth factor receptor beta
Type:Enzyme
Mol. Mass.:123922.25
Organism:Homo sapiens (Human)
Description:P09619
Residue:1106
BDBM50192852
NameBDBM50192852
Synonyms:CHEMBL3358975
TypeSmall organic molecule
Emp. Form.C18H12FN3O
Mol. Mass.305.3058
SMILESFc1ccc(cc1)-c1nc(c[nH]c1=O)-c1c[nH]c2ccccc12