Reaction Details
TargetMast/stem cell growth factor receptor Kit
LigandBDBM50192871
Substrate/Competitorn/a
Meas. Tech.ChEBML_1448601
IC50 400±n/a nM
Citation Horbert, RPinchuk, BJohannes, ESchlosser, JSchmidt, DCappel, DTotzke, FSchächtele, CPeifer, C Optimization of potent DFG-in inhibitors of platelet derived growth factor receptorß (PDGF-Rß) guided by water thermodynamics. J Med Chem58:170-82 (2015) 
 
Mast/stem cell growth factor receptor Kit
Name:Mast/stem cell growth factor receptor Kit
Type:Protein
Mol. Mass.:109869.37
Organism:Homo sapiens (Human)
Description:P10721
Residue:976
BDBM50192871
NameBDBM50192871
Synonyms:CHEMBL3358996
TypeSmall organic molecule
Emp. Form.C19H18N2O5
Mol. Mass.354.3566
SMILESCOc1cc(cc(OC)c1OC)-c1nc(c[nH]c1=O)-c1ccc(O)cc1