Reaction Details
TargetPyruvate kinase
LigandBDBM50192869
Substrate/Competitorn/a
Meas. Tech.ChEBML_1448600
IC50 16±n/a nM
Citation Horbert, RPinchuk, BJohannes, ESchlosser, JSchmidt, DCappel, DTotzke, FSchächtele, CPeifer, C Optimization of potent DFG-in inhibitors of platelet derived growth factor receptorß (PDGF-Rß) guided by water thermodynamics. J Med Chem58:170-82 (2015) 
 
Pyruvate kinase
Name:Pyruvate kinase
Type:PROTEIN
Mol. Mass.:63128.44
Organism:Staphylococcus aureus (strain MRSA252)
Description:ChEMBL_1434805
Residue:585
BDBM50192869
NameBDBM50192869
Synonyms:CIS-3,4-DIHYDROHAMACANTHIN B
TypeSmall organic molecule
Emp. Form.C20H16Br2N4O
Mol. Mass.488.175
SMILESBrc1ccc2c(c[nH]c2c1)[C@@H]1CNC(=O)[C@@H](N1)c1c[nH]c2cc(Br)ccc12