Reaction Details
TargetPlatelet-derived growth factor receptor beta
LigandBDBM50192860
Substrate/Competitorn/a
Meas. Tech.ChEBML_1447789
IC50 2000±n/a nM
Citation Horbert, RPinchuk, BJohannes, ESchlosser, JSchmidt, DCappel, DTotzke, FSchächtele, CPeifer, C Optimization of potent DFG-in inhibitors of platelet derived growth factor receptorß (PDGF-Rß) guided by water thermodynamics. J Med Chem58:170-82 (2015) 
 
Platelet-derived growth factor receptor beta
Name:Platelet-derived growth factor receptor beta
Type:Enzyme
Mol. Mass.:123922.25
Organism:Homo sapiens (Human)
Description:P09619
Residue:1106
BDBM50192860
NameBDBM50192860
Synonyms:CHEMBL1986478
TypeSmall organic molecule
Emp. Form.C20H14N4O
Mol. Mass.326.3514
SMILESO=c1[nH]cc(nc1-c1c[nH]c2ccccc12)-c1c[nH]c2ccccc12