Reaction Details
TargetMu-type opioid receptor
LigandBDBM50314879
Substrate/Competitorn/a
Meas. Tech.ChEMBL_1456841 (CHEMBL3367574)
Ki 420±n/a nM
Citation Weltrowska, GLemieux, CChung, NNGuo, JJWilkes, BCSchiller, PW 'Carba'-carfentanil (trans isomer): aµ opioid receptor (MOR) partial agonist with a distinct binding mode. Bioorg Med Chem22:4581-6 (2014) 
 
Mu-type opioid receptor
Name:Mu-type opioid receptor
Type:G Protein-Coupled Receptor (GPCR)
Mol. Mass.:44503.11
Organism:Rattus norvegicus (rat)
Description:Competition binding assays were carried out using membrane preparations from transfected HN9.10 cells that constitutively expressed the mu opioid receptor.
Residue:398
BDBM50314879
NameBDBM50314879
Synonyms:CHEMBL1091995 | N-formylnormorphine
TypeSmall organic molecule
Emp. Form.C17H17NO4
Mol. Mass.299.3212
SMILESO[C@H]1C=C[C@H]2[C@H]3Cc4ccc(O)c5O[C@@H]1[C@]2(CCN3C=O)c45