Reaction Details
TargetLysosomal acid glucosylceramidase
LigandBDBM50101405
Substrate/Competitorn/a
Meas. Tech.ChEMBL_1460503 (CHEMBL3395305)
pH7.3±n/a
Ki 5500±n/a nM
Commentsextracted
Citation Castilla, JRísquez, RHigaki, KNanba, EOhno, KSuzuki, YDíaz, YOrtiz Mellet, CGarcía Fernández, JMCastillón, S Conformationally-locked N-glycosides: exploiting long-range non-glycone interactions in the design of pharmacological chaperones for Gaucher disease. Eur J Med Chem90:258-66 (2015) 
 
Lysosomal acid glucosylceramidase
Name:Lysosomal acid glucosylceramidase
Type:PROTEIN
Mol. Mass.:59862.93
Organism:Bos taurus
Description:ChEMBL_1460504
Residue:536
BDBM50101405
NameBDBM50101405
Synonyms:CHEMBL3393931
TypeSmall organic molecule
Emp. Form.C23H43NO6S
Mol. Mass.461.656
SMILES[H][C@]12OC(SCCCCCCCCCCCCCCCCO)=N[C@@]1([H])O[C@H](CO)[C@H](O)[C@@H]2O