Reaction Details
TargetFructose-1,6-bisphosphatase 1
LigandBDBM18137
Substrate/Competitorn/a
Meas. Tech.ChEMBL_1460519 (CHEMBL3395429)
IC50 3200±n/a nM
Citation Bie, JLiu, SLi, ZMu, YXu, BShen, Z Discovery of novel indole derivatives as allosteric inhibitors of fructose-1,6-bisphosphatase. Eur J Med Chem90:394-405 (2015) 
 
Fructose-1,6-bisphosphatase 1
Name:Fructose-1,6-bisphosphatase 1
Type:Protein
Mol. Mass.:36843.58
Organism:Homo sapiens (Human)
Description:Liver FBPase (P09467)
Residue:338
BDBM18137
NameBDBM18137
Synonyms:AMP US11185100, TABLE 7.3 adenosine 5 -monophosphate | {[(2R,3S,4R,5R)-5-(6-amino-9H-purin-9-yl)-3,4-dihydroxyoxolan-2-yl]methoxy}phosphonic acid
TypeNucleoside or nucleotide
Emp. Form.C10H14N5O7P
Mol. Mass.347.2212
SMILESNc1ncnc2n(cnc12)[C@@H]1O[C@H](COP(O)(O)=O)[C@@H](O)[C@H]1O