Reaction Details
TargetCytochrome P450 2A13
LigandBDBM50240772
Substrate/Competitorn/a
Meas. Tech.ChEMBL_1486539 (CHEMBL3532208)
Ki 6500±n/a nM
Citation Stephens, ESWalsh, AAScott, EE Evaluation of inhibition selectivity for human cytochrome P450 2A enzymes. Drug Metab Dispos40:1797-802 (2012) 
 
Cytochrome P450 2A13
Name:Cytochrome P450 2A13
Type:Protein
Mol. Mass.:56702.46
Organism:Homo sapiens (Human)
Description:Q16696
Residue:494
BDBM50240772
NameBDBM50240772
Synonyms:(1R,2S)-(-)-2-phenylcyclopropylamine (tranylcypromine)2-Phenyl-cyclopropylamine CHEMBL1179 TRANYLCYPROMINE US10836743, Compound TCP US9180183, Tranylcypromine rel-Tranylcypromine
TypeSmall organic molecule
Emp. Form.C9H11N
Mol. Mass.133.1903
SMILESN[C@@H]1C[C@H]1c1ccccc1