Reaction Details
TargetTyrosine-protein kinase JAK2
LigandBDBM112605
Substrate/Competitorn/a
Meas. Tech.ChEMBL_1441461 (CHEMBL3374010)
IC50 180±n/a nM
Citation de Vicente, JLemoine, RBartlett, MHermann, JCHekmat-Nejad, MHenningsen, RJin, SKuglstatter, ALi, HLovey, AJMenke, JNiu, LPatel, VPetersen, ASetti, LShao, ATivitmahaisoon, PVu, MDSoth, M Scaffold hopping towards potent and selective JAK3 inhibitors: discovery of novel C-5 substituted pyrrolopyrazines. Bioorg Med Chem Lett24:4969-75 (2014) 
 
Tyrosine-protein kinase JAK2
Name:Tyrosine-protein kinase JAK2
Type:Protein
Mol. Mass.:130684.68
Organism:Homo sapiens (Human)
Description:O60674
Residue:1132
BDBM112605
NameBDBM112605
Synonyms:US8618103, I-101
TypeSmall organic molecule
Emp. Form.C20H26N8O3S
Mol. Mass.458.537
SMILESCS(=O)(=O)N1CCC[C@@H](C1)Nc1nc(ncc1-c1cnc2[nH]ccc2n1)N1CC[C@@H](O)C1