Reaction Details
TargetTyrosine-protein kinase JAK2
LigandBDBM112586
Substrate/Competitorn/a
Meas. Tech.ChEMBL_1441461 (CHEMBL3374010)
IC50 45±n/a nM
Citation de Vicente, JLemoine, RBartlett, MHermann, JCHekmat-Nejad, MHenningsen, RJin, SKuglstatter, ALi, HLovey, AJMenke, JNiu, LPatel, VPetersen, ASetti, LShao, ATivitmahaisoon, PVu, MDSoth, M Scaffold hopping towards potent and selective JAK3 inhibitors: discovery of novel C-5 substituted pyrrolopyrazines. Bioorg Med Chem Lett24:4969-75 (2014) 
 
Tyrosine-protein kinase JAK2
Name:Tyrosine-protein kinase JAK2
Type:Protein
Mol. Mass.:130684.68
Organism:Homo sapiens (Human)
Description:O60674
Residue:1132
BDBM112586
NameBDBM112586
Synonyms:US8618103, I-82
TypeSmall organic molecule
Emp. Form.C21H29N9O2S
Mol. Mass.471.579
SMILESCN1CCN(CC1)c1ncc(c(N[C@H]2CCCN(C2)S(C)(=O)=O)n1)-c1cnc2[nH]ccc2n1