Reaction Details
TargetTyrosine-protein kinase JAK3
LigandBDBM112591
Substrate/Competitorn/a
Meas. Tech.ChEMBL_1441460 (CHEMBL3374009)
IC50 18±n/a nM
Citation de Vicente, JLemoine, RBartlett, MHermann, JCHekmat-Nejad, MHenningsen, RJin, SKuglstatter, ALi, HLovey, AJMenke, JNiu, LPatel, VPetersen, ASetti, LShao, ATivitmahaisoon, PVu, MDSoth, M Scaffold hopping towards potent and selective JAK3 inhibitors: discovery of novel C-5 substituted pyrrolopyrazines. Bioorg Med Chem Lett24:4969-75 (2014) 
 
Tyrosine-protein kinase JAK3
Name:Tyrosine-protein kinase JAK3
Type:Protein
Mol. Mass.:125111.08
Organism:Homo sapiens (Human)
Description:P52333
Residue:1124
BDBM112591
NameBDBM112591
Synonyms:US8618103, I-87
TypeSmall organic molecule
Emp. Form.C20H26N8O3S
Mol. Mass.458.537
SMILESCS(=O)(=O)N1CCC[C@@H](C1)Nc1nc(ncc1-c1cnc2[nH]ccc2n1)N1CCOCC1