Reaction Details
TargetTyrosine-protein kinase JAK3
LigandBDBM50102648
Substrate/Competitorn/a
Meas. Tech.ChEMBL_1441460 (CHEMBL3374009)
IC50 2.0±n/a nM
Citation de Vicente, JLemoine, RBartlett, MHermann, JCHekmat-Nejad, MHenningsen, RJin, SKuglstatter, ALi, HLovey, AJMenke, JNiu, LPatel, VPetersen, ASetti, LShao, ATivitmahaisoon, PVu, MDSoth, M Scaffold hopping towards potent and selective JAK3 inhibitors: discovery of novel C-5 substituted pyrrolopyrazines. Bioorg Med Chem Lett24:4969-75 (2014) 
 
Tyrosine-protein kinase JAK3
Name:Tyrosine-protein kinase JAK3
Type:Protein
Mol. Mass.:125111.08
Organism:Homo sapiens (Human)
Description:P52333
Residue:1124
BDBM50102648
NameBDBM50102648
Synonyms:CHEMBL3335686
TypeSmall organic molecule
Emp. Form.C17H26N6O3S
Mol. Mass.394.492
SMILESCC(C)(C)CS(=O)(=O)N1CCC[C@@H](C1)NC(=O)Nc1cnc2[nH]ccc2n1