Reaction Details
TargetTyrosine-protein kinase JAK3
LigandBDBM112536
Substrate/Competitorn/a
Meas. Tech.ChEMBL_1441460 (CHEMBL3374009)
IC50 2.0±n/a nM
Citation de Vicente, JLemoine, RBartlett, MHermann, JCHekmat-Nejad, MHenningsen, RJin, SKuglstatter, ALi, HLovey, AJMenke, JNiu, LPatel, VPetersen, ASetti, LShao, ATivitmahaisoon, PVu, MDSoth, M Scaffold hopping towards potent and selective JAK3 inhibitors: discovery of novel C-5 substituted pyrrolopyrazines. Bioorg Med Chem Lett24:4969-75 (2014) 
 
Tyrosine-protein kinase JAK3
Name:Tyrosine-protein kinase JAK3
Type:Protein
Mol. Mass.:125111.08
Organism:Homo sapiens (Human)
Description:P52333
Residue:1124
BDBM112536
NameBDBM112536
Synonyms:US8618103, I-32
TypeSmall organic molecule
Emp. Form.C21H28N6O2S
Mol. Mass.428.551
SMILESCC(C)(C)CS(=O)(=O)N1CCC[C@@H](C1)Nc1ncccc1-c1cnc2[nH]ccc2n1