Reaction Details
TargetDisintegrin and metalloproteinase domain-containing protein 17
LigandBDBM50025159
Substrate/Competitorn/a
Meas. Tech.ChEMBL_1431427 (CHEMBL3389270)
IC50>10000±n/a nM
Citation Nara, HSato, KNaito, TMototani, HOki, HYamamoto, YKuno, HSantou, TKanzaki, NTerauchi, JUchikawa, OKori, M Discovery of novel, highly potent, and selective quinazoline-2-carboxamide-based matrix metalloproteinase (MMP)-13 inhibitors without a zinc binding group using a structure-based design approach. J Med Chem57:8886-902 (2014) 
 
Disintegrin and metalloproteinase domain-containing protein 17
Name:Disintegrin and metalloproteinase domain-containing protein 17
Type:Enzyme
Mol. Mass.:93007.89
Organism:Homo sapiens (Human)
Description:
Residue:824
BDBM50025159
NameBDBM50025159
Synonyms:CHEMBL3337869
TypeSmall organic molecule
Emp. Form.C17H15N3O3
Mol. Mass.309.3193
SMILESCOc1cccc(CNC(=O)c2nc3ccccc3c(=O)[nH]2)c1