Reaction Details
TargetMatrix metalloproteinase-14
LigandBDBM50025159
Substrate/Competitorn/a
Meas. Tech.ChEMBL_1431426 (CHEMBL3389269)
IC50>10000±n/a nM
Citation Nara, HSato, KNaito, TMototani, HOki, HYamamoto, YKuno, HSantou, TKanzaki, NTerauchi, JUchikawa, OKori, M Discovery of novel, highly potent, and selective quinazoline-2-carboxamide-based matrix metalloproteinase (MMP)-13 inhibitors without a zinc binding group using a structure-based design approach. J Med Chem57:8886-902 (2014) 
 
Matrix metalloproteinase-14
Name:Matrix metalloproteinase-14
Type:Protein
Mol. Mass.:65900.19
Organism:Homo sapiens (Human)
Description:P50281
Residue:582
BDBM50025159
NameBDBM50025159
Synonyms:CHEMBL3337869
TypeSmall organic molecule
Emp. Form.C17H15N3O3
Mol. Mass.309.3193
SMILESCOc1cccc(CNC(=O)c2nc3ccccc3c(=O)[nH]2)c1