Reaction Details
TargetCollagenase 3
LigandBDBM50102752
Substrate/Competitorn/a
Meas. Tech.ChEMBL_1431418 (CHEMBL3388707)
IC50 0.150000±n/a nM
Citation Nara, HSato, KNaito, TMototani, HOki, HYamamoto, YKuno, HSantou, TKanzaki, NTerauchi, JUchikawa, OKori, M Discovery of novel, highly potent, and selective quinazoline-2-carboxamide-based matrix metalloproteinase (MMP)-13 inhibitors without a zinc binding group using a structure-based design approach. J Med Chem57:8886-902 (2014) 
 
Collagenase 3
Name:Collagenase 3
Type:Enzyme
Mol. Mass.:53808.06
Organism:Homo sapiens (Human)
Description:P45452
Residue:471
BDBM50102752
NameBDBM50102752
Synonyms:CHEMBL3359089
TypeSmall organic molecule
Emp. Form.C25H21F2N3O4
Mol. Mass.465.4487
SMILESCOc1cccc(CNC(=O)c2nc3ccc(F)c(OCCc4ccc(F)cc4)c3c(=O)[nH]2)c1