Reaction Details
TargetCollagenase 3
LigandBDBM50102808
Substrate/Competitorn/a
Meas. Tech.ChEMBL_1431418 (CHEMBL3388707)
IC50 23±n/a nM
Citation Nara, HSato, KNaito, TMototani, HOki, HYamamoto, YKuno, HSantou, TKanzaki, NTerauchi, JUchikawa, OKori, M Discovery of novel, highly potent, and selective quinazoline-2-carboxamide-based matrix metalloproteinase (MMP)-13 inhibitors without a zinc binding group using a structure-based design approach. J Med Chem57:8886-902 (2014) 
 
Collagenase 3
Name:Collagenase 3
Type:Enzyme
Mol. Mass.:53808.06
Organism:Homo sapiens (Human)
Description:P45452
Residue:471
BDBM50102808
NameBDBM50102808
Synonyms:CHEMBL3359066
TypeSmall organic molecule
Emp. Form.C18H17N3O5S
Mol. Mass.387.41
SMILESCOc1cccc(CNC(=O)c2nc3ccc(cc3c(=O)[nH]2)S(C)(=O)=O)c1