Reaction Details
TargetCytochrome P450 2J2
LigandBDBM92332
Substrate/Competitorn/a
Meas. Tech.ChEMBL_1485701 (CHEMBL3541093)
IC50>50000±n/a nM
Citation Ren, SZeng, JMei, YZhang, JZYan, SFFei, JChen, L Discovery and characterization of novel, potent, and selective cytochrome P450 2J2 inhibitors. Drug Metab Dispos41:60-71 (2012) 
 
Cytochrome P450 2J2
Name:Cytochrome P450 2J2
Type:Enzyme
Mol. Mass.:57623.04
Organism:Homo sapiens (Human)
Description:P51589
Residue:502
BDBM92332
NameBDBM92332
Synonyms:Tenoxicam
TypeSmall organic molecule
Emp. Form.C13H11N3O4S2
Mol. Mass.337.374
SMILESCN1C(C(=O)Nc2ccccn2)=C(O)c2sccc2S1(=O)=O