Reaction Details
TargetCytochrome P450 2J2
LigandBDBM50070208
Substrate/Competitorn/a
Meas. Tech.ChEMBL_1485701 (CHEMBL3541093)
IC50>50000±n/a nM
Citation Ren, SZeng, JMei, YZhang, JZYan, SFFei, JChen, L Discovery and characterization of novel, potent, and selective cytochrome P450 2J2 inhibitors. Drug Metab Dispos41:60-71 (2012) 
 
Cytochrome P450 2J2
Name:Cytochrome P450 2J2
Type:Enzyme
Mol. Mass.:57623.04
Organism:Homo sapiens (Human)
Description:P51589
Residue:502
BDBM50070208
NameBDBM50070208
Synonyms:A-65006 CHEBI:6375 Prevacid Prevacid Delayed Release Prevacid iv
TypeSmall organic molecule
Emp. Form.C16H14F3N3O2S
Mol. Mass.369.361
SMILESCc1c(OCC(F)(F)F)ccnc1C[S+]([O-])c1nc2ccccc2[nH]1