Reaction Details
TargetCytochrome P450 2C9
LigandBDBM78934
Substrate/Competitorn/a
Meas. Tech.ChEMBL_1485704 (CHEMBL3541096)
IC50 28400±n/a nM
Citation Ren, SZeng, JMei, YZhang, JZYan, SFFei, JChen, L Discovery and characterization of novel, potent, and selective cytochrome P450 2J2 inhibitors. Drug Metab Dispos41:60-71 (2012) 
 
Cytochrome P450 2C9
Name:Cytochrome P450 2C9
Type:Enzyme
Mol. Mass.:55636.33
Organism:Homo sapiens (Human)
Description:P11712
Residue:490
BDBM78934
NameBDBM78934
Synonyms:2-methoxyacetic acid [(1S,2S)-2-[2-[3-(1H-benzimidazol-2-yl)propyl-methyl-amino]ethyl]-6-fluoro-1-isopropyl-tetralin-2-yl] ester;hydrate;hydrochloride MLS001056800 SMR000326970 [(1S,2S)-2-[2-[3-(1H-benzimidazol-2-yl)propyl-methyl-amino]ethyl]-6-fluoranyl-1-propan-2-yl-3,4-dihydro-1H-naphthalen-2-yl] 2-methoxyethanoate;hydrate;hydrochloride cid_16746591
TypeSmall organic molecule
Emp. Form.C29H38FN3O3
Mol. Mass.495.6287
SMILESCOCC(=O)O[C@]1(CCN(C)CCCc2nc3ccccc3[nH]2)CCc2cc(F)ccc2[C@@H]1C(C)C