Reaction Details
TargetCytochrome P450 2C19
LigandBDBM50041457
Substrate/Competitorn/a
Meas. Tech.ChEMBL_1485705 (CHEMBL3541097)
IC50>50000±n/a nM
Citation Ren, SZeng, JMei, YZhang, JZYan, SFFei, JChen, L Discovery and characterization of novel, potent, and selective cytochrome P450 2J2 inhibitors. Drug Metab Dispos41:60-71 (2012) 
 
Cytochrome P450 2C19
Name:Cytochrome P450 2C19
Type:Enzyme
Mol. Mass.:55935.47
Organism:Homo sapiens (Human)
Description:P33261
Residue:490
BDBM50041457
NameBDBM50041457
Synonyms:4-[(7-chloroquinolin-4-yl)amino]-2-[(diethylamino)methyl]phenol CHEMBL682 | med.21724, Compound 188
TypeSmall organic molecule
Emp. Form.C20H22ClN3O
Mol. Mass.355.861
SMILESCCN(CC)Cc1cc(Nc2ccnc3cc(Cl)ccc23)ccc1O