Reaction Details
TargetCytochrome P450 2J2
LigandBDBM50103595
Substrate/Competitorn/a
Meas. Tech.ChEMBL_1485701 (CHEMBL3541093)
IC50>50000±n/a nM
Citation Ren, SZeng, JMei, YZhang, JZYan, SFFei, JChen, L Discovery and characterization of novel, potent, and selective cytochrome P450 2J2 inhibitors. Drug Metab Dispos41:60-71 (2012) 
 
Cytochrome P450 2J2
Name:Cytochrome P450 2J2
Type:Enzyme
Mol. Mass.:57623.04
Organism:Homo sapiens (Human)
Description:P51589
Residue:502
BDBM50103595
NameBDBM50103595
Synonyms:Brumetadina Cimetidine Tagamet HB Valmagen
TypeSmall organic molecule
Emp. Form.C10H16N6S
Mol. Mass.252.339
SMILESCN\C(NC#N)=N/CCSCc1nc[nH]c1C