Reaction Details
TargetCytochrome P450 2D6
LigandBDBM41132
Substrate/Competitorn/a
Meas. Tech.ChEMBL_1485702 (CHEMBL3541094)
IC50>50000±n/a nM
Citation Ren, SZeng, JMei, YZhang, JZYan, SFFei, JChen, L Discovery and characterization of novel, potent, and selective cytochrome P450 2J2 inhibitors. Drug Metab Dispos41:60-71 (2012) 
 
Cytochrome P450 2D6
Name:Cytochrome P450 2D6
Type:Protein
Mol. Mass.:55774.82
Organism:Homo sapiens (Human)
Description:P10635
Residue:497
BDBM41132
NameBDBM41132
Synonyms:MLS000028542 TRIAMCINOLONE | cid_31307
TypeSmall organic molecule
Emp. Form.C21H27FO6
Mol. Mass.394.4339
SMILESC[C@]12C[C@H](O)[C@@]3(F)[C@@H](CCC4=CC(=O)C=C[C@]34C)[C@@H]1C[C@@H](O)[C@]2(O)C(=O)CO