Reaction Details
TargetCytochrome P450 3A4
LigandBDBM25756
Substrate/Competitorn/a
Meas. Tech.ChEMBL_1485703 (CHEMBL3541095)
IC50>50000±n/a nM
Citation Ren, SZeng, JMei, YZhang, JZYan, SFFei, JChen, L Discovery and characterization of novel, potent, and selective cytochrome P450 2J2 inhibitors. Drug Metab Dispos41:60-71 (2012) 
 
Cytochrome P450 3A4
Name:Cytochrome P450 3A4
Type:Enzyme
Mol. Mass.:57349.57
Organism:Homo sapiens (Human)
Description:n/a
Residue:503
BDBM25756
NameBDBM25756
Synonyms:(2R,3R)-2,3-dihydroxysuccinic acid;1-(isopropylamino)-3-[4-(2-methoxyethyl)phenoxy]propan-2-ol CHEMBL13 Spesicor metoprolol tartrate | {2-hydroxy-3-[4-(2-methoxyethyl)phenoxy]propyl}(propan-2-yl)amine
TypeSmall organic molecule
Emp. Form.C15H25NO3
Mol. Mass.267.3639
SMILESCOCCc1ccc(OCC(O)CNC(C)C)cc1