Reaction Details
TargetCytochrome P450 2D6
LigandBDBM50045000
Substrate/Competitorn/a
Meas. Tech.ChEMBL_1485702 (CHEMBL3541094)
IC50>50000±n/a nM
Citation Ren, SZeng, JMei, YZhang, JZYan, SFFei, JChen, L Discovery and characterization of novel, potent, and selective cytochrome P450 2J2 inhibitors. Drug Metab Dispos41:60-71 (2012) 
 
Cytochrome P450 2D6
Name:Cytochrome P450 2D6
Type:Protein
Mol. Mass.:55774.82
Organism:Homo sapiens (Human)
Description:P10635
Residue:497
BDBM50045000
NameBDBM50045000
Synonyms:(NFLX)1-Ethyl-6-fluoro-4-oxo-7-piperazin-1-yl-1,4-dihydro-quinoline-3-carboxylic acid 1-Ethyl-6-fluoro-4-oxo-7-piperazin-1-yl-1,4,4a,8a-tetrahydro-quinoline-3-carboxylic acid (norfloxacin) 1-Ethyl-6-fluoro-4-oxo-7-piperazin-1-yl-1,4-dihydro-quinoline-3-carboxylic acid (Norfloxacin) 1-Ethyl-6-fluoro-4-oxo-7-piperazin-1-yl-1,4-dihydro-quinoline-3-carboxylic acid(Norfloxacin) 1-ethyl-6-fluoro-7-hexahydro-1-pyrazinyl-4-oxo-1,4-dihydro-3-quinolinecarboxylic acid Chibroxin NORFLOXACIN | Noroxin
TypeSmall organic molecule
Emp. Form.C16H18FN3O3
Mol. Mass.319.3308
SMILESCCn1cc(C(O)=O)c(=O)c2cc(F)c(cc12)N1CCNCC1