Reaction Details
TargetPotassium voltage-gated channel subfamily H member 2
LigandBDBM50103561
Substrate/Competitorn/a
Meas. Tech.ChEMBL_1434157 (CHEMBL3383394)
IC50 3600±n/a nM
Citation Scott, JSBowker, SSBrocklehurst, KJBrown, HSClarke, DSEaster, AErtan, AGoldberg, KHudson, JAKavanagh, SLaber, DLeach, AGMacFaul, PAMartin, EAMcKerrecher, DSchofield, PSvensson, PHTeague, J Circumventing seizure activity in a series of G protein coupled receptor 119 (GPR119) agonists. J Med Chem57:8984-98 (2014) 
 
Potassium voltage-gated channel subfamily H member 2
Name:Potassium voltage-gated channel subfamily H member 2
Type:Multi-pass membrane protein
Mol. Mass.:126672.65
Organism:Homo sapiens (Human)
Description:Q12809
Residue:1159
BDBM50103561
NameBDBM50103561
Synonyms:CHEMBL3357996
TypeSmall organic molecule
Emp. Form.C21H17F3N8O2
Mol. Mass.470.4073
SMILESC[C@@H]1CN(CCN1c1ncc(OCc2ccc(cc2C#N)C#N)cn1)c1nnc(o1)C(F)(F)F