Reaction Details
TargetEndothelial PAS domain-containing protein 1
LigandBDBM50105278
Substrate/Competitorn/a
Meas. Tech.ChEMBL_1506501 (CHEMBL3599967)
Kd 109±n/a nM
Citation Scheuermann, THStroud, DSleet, CEBayeh, LShokri, CWang, HCaldwell, CGLonggood, JMacMillan, JBBruick, RKGardner, KHTambar, UK Isoform-Selective and Stereoselective Inhibition of Hypoxia Inducible Factor-2. J Med Chem58:5930-41 (2015) 
 
Endothelial PAS domain-containing protein 1
Name:Endothelial PAS domain-containing protein 1
Type:PROTEIN
Mol. Mass.:96453.58
Organism:Homo sapiens (Human)
Description:ChEMBL_1506501
Residue:870
BDBM50105278
NameBDBM50105278
Synonyms:CHEMBL3597778
TypeSmall organic molecule
Emp. Form.C16H13BrIN5
Mol. Mass.482.116
SMILESBrc1cccc(c1)[C@@H]1C[C@H](c2cccc(I)c2)n2nnnc2N1