Reaction Details
TargetEndothelial PAS domain-containing protein 1/Hypoxia-inducible factor 1-alpha
LigandBDBM50105278
Substrate/Competitorn/a
Meas. Tech.ChEMBL_1506505 (CHEMBL3599971)
IC50>30000±n/a nM
Citation Scheuermann, THStroud, DSleet, CEBayeh, LShokri, CWang, HCaldwell, CGLonggood, JMacMillan, JBBruick, RKGardner, KHTambar, UK Isoform-Selective and Stereoselective Inhibition of Hypoxia Inducible Factor-2. J Med Chem58:5930-41 (2015) 
 
Endothelial PAS domain-containing protein 1/Hypoxia-inducible factor 1-alpha
Name:Endothelial PAS domain-containing protein 1/Hypoxia-inducible factor 1-alpha
Synonyms:Hypoxia inducible factors; HIF-1-alpha, HIF-2-alpha
Type:n/a
Mol. Mass.:n/a
Description:ASSAY_ID of ChEMBL is 799337
Components:This complex has 2 components.
Component 1
Name:Hypoxia-inducible factor 1-alpha
Type:Protein
Mol. Mass.:92647.24
Organism:Homo sapiens (Human)
Description:Q16665
Residue:826
Component 2
Name:Endothelial PAS domain-containing protein 1
Synonyms:BHLHE73 EPAS1_HUMAN MOP2 endothelial PAS domain-containing protein 1
Type:PROTEIN
Mol. Mass.:96453.58
Organism:Homo sapiens (Human)
Description:ChEMBL_1506501
Residue:870
BDBM50105278
NameBDBM50105278
Synonyms:CHEMBL3597778
TypeSmall organic molecule
Emp. Form.C16H13BrIN5
Mol. Mass.482.116
SMILESBrc1cccc(c1)[C@@H]1C[C@H](c2cccc(I)c2)n2nnnc2N1