Reaction Details
TargetCarbonic anhydrase 2
LigandBDBM50106414
Substrate/Competitorn/a
Meas. Tech.ChEMBL_1508537 (CHEMBL3602573)
Ki 92±n/a nM
Citation Meleddu, RMaccioni, EDistinto, SBianco, GMelis, CAlcaro, SCottiglia, FCeruso, MSupuran, CT New 4-[(3-cyclohexyl-4-aryl-2,3-dihydro-1,3-thiazol-2-ylidene)amino]benzene-1-sulfonamides, synthesis and inhibitory activity toward carbonic anhydrase I, II, IX, XII. Bioorg Med Chem Lett25:3281-4 (2015) 
 
Carbonic anhydrase 2
Name:Carbonic anhydrase 2
Type:Enzyme
Mol. Mass.:29250.71
Organism:Homo sapiens (Human)
Description:P00918
Residue:260
BDBM50106414
NameBDBM50106414
Synonyms:CHEMBL3601882
TypeSmall organic molecule
Emp. Form.C21H22ClN3O2S2
Mol. Mass.448.001
SMILESNS(=O)(=O)c1ccc(cc1)\N=c1/scc(-c2ccc(Cl)cc2)n1C1CCCCC1