Reaction Details
TargetPhosphatidylinositol 4,5-bisphosphate 3-kinase catalytic subunit beta isoform
LigandBDBM50107258
Substrate/Competitorn/a
Meas. Tech.ChEMBL_1508843 (CHEMBL3603392)
IC50 6310±n/a nM
Citation Raubo, PAndrews, DMMcKelvie, JCRobb, GRSmith, JMSwarbrick, MEWaring, MJ Discovery of potent, selective small molecule inhibitors ofa-subtype of type III phosphatidylinositol-4-kinase (PI4KIIIa). Bioorg Med Chem Lett25:3189-93 (2015) 
 
Phosphatidylinositol 4,5-bisphosphate 3-kinase catalytic subunit beta isoform
Name:Phosphatidylinositol 4,5-bisphosphate 3-kinase catalytic subunit beta isoform
Type:Enzyme Subunit
Mol. Mass.:122769.00
Organism:Homo sapiens (Human)
Description:P42338
Residue:1070
BDBM50107258
NameBDBM50107258
Synonyms:CHEMBL3600683
TypeSmall organic molecule
Emp. Form.C14H13N3OS
Mol. Mass.271.338
SMILESCCOc1ccc(cn1)-c1ccc2nc(N)sc2c1