Reaction Details
TargetPhosphatidylinositol 4,5-bisphosphate 3-kinase catalytic subunit beta isoform
LigandBDBM50107255
Substrate/Competitorn/a
Meas. Tech.ChEMBL_1508843 (CHEMBL3603392)
IC50<199526±n/a nM
Citation Raubo, PAndrews, DMMcKelvie, JCRobb, GRSmith, JMSwarbrick, MEWaring, MJ Discovery of potent, selective small molecule inhibitors ofa-subtype of type III phosphatidylinositol-4-kinase (PI4KIIIa). Bioorg Med Chem Lett25:3189-93 (2015) 
 
Phosphatidylinositol 4,5-bisphosphate 3-kinase catalytic subunit beta isoform
Name:Phosphatidylinositol 4,5-bisphosphate 3-kinase catalytic subunit beta isoform
Type:Enzyme Subunit
Mol. Mass.:122769.00
Organism:Homo sapiens (Human)
Description:P42338
Residue:1070
BDBM50107255
NameBDBM50107255
Synonyms:CHEMBL3600783
TypeSmall organic molecule
Emp. Form.C23H27N3O2S
Mol. Mass.409.544
SMILESC[C@H](Nc1nc2ccc(cc2s1)-c1ccn(CC2CC2)c(=O)c1)C1CCOCC1