Reaction Details
TargetPhosphatidylinositol 4,5-bisphosphate 3-kinase catalytic subunit delta isoform
LigandBDBM50107269
Substrate/Competitorn/a
Meas. Tech.ChEMBL_1508845 (CHEMBL3603394)
IC50 1995±n/a nM
Citation Raubo, PAndrews, DMMcKelvie, JCRobb, GRSmith, JMSwarbrick, MEWaring, MJ Discovery of potent, selective small molecule inhibitors ofa-subtype of type III phosphatidylinositol-4-kinase (PI4KIIIa). Bioorg Med Chem Lett25:3189-93 (2015) 
 
Phosphatidylinositol 4,5-bisphosphate 3-kinase catalytic subunit delta isoform
Name:Phosphatidylinositol 4,5-bisphosphate 3-kinase catalytic subunit delta isoform
Type:Enzyme Subunit
Mol. Mass.:119489.41
Organism:Homo sapiens (Human)
Description:O00329
Residue:1044
BDBM50107269
NameBDBM50107269
Synonyms:CHEMBL3600694
TypeSmall organic molecule
Emp. Form.C14H13N3O2S
Mol. Mass.287.337
SMILESNc1nc2ccc(cc2s1)-c1ccc(OCCO)nc1