Reaction Details
TargetPhosphatidylinositol 4-phosphate 5-kinase type-1 gamma
LigandBDBM50107261
Substrate/Competitorn/a
Meas. Tech.ChEMBL_1508846 (CHEMBL3603395)
IC50<100000±n/a nM
Citation Raubo, PAndrews, DMMcKelvie, JCRobb, GRSmith, JMSwarbrick, MEWaring, MJ Discovery of potent, selective small molecule inhibitors ofa-subtype of type III phosphatidylinositol-4-kinase (PI4KIIIa). Bioorg Med Chem Lett25:3189-93 (2015) 
 
Phosphatidylinositol 4-phosphate 5-kinase type-1 gamma
Name:Phosphatidylinositol 4-phosphate 5-kinase type-1 gamma
Type:PROTEIN
Mol. Mass.:73241.99
Organism:Homo sapiens (Human)
Description:ChEMBL_1508846
Residue:668
BDBM50107261
NameBDBM50107261
Synonyms:CHEMBL3600685
TypeSmall organic molecule
Emp. Form.C14H13N3OS
Mol. Mass.271.338
SMILESCOCc1ccc(cn1)-c1ccc2nc(N)sc2c1